Target
Tegument protein VP16
Ligand
BDBM93927
Substrate
Meas. Tech.
Counterscreen for inhibitors of COUP-TFII (NR2F2): Luminescence-based cell-based high throughput dose response assay to identify inhibitors of the Herpes Virus Virion Protein 16 (VP16)
IC50
9487±n/a nM
Citation
 PubChem, PC Counterscreen for inhibitors of COUP-TFII (NR2F2): Luminescence-based cell-based high throughput dose response assay to identify inhibitors of the Herpes Virus Virion Protein 16 (VP16) PubChem Bioassay (2013)[AID] 
Target
Name:
Tegument protein VP16
Synonyms:
Alpha trans-inducing protein (VP16) transactivating tegument protein VP16
Type:
PROTEIN
Mol. Mass.:
54325.13
Organism:
Human herpesvirus 1 (strain 17) (HHV-1) (Human herpes simplex virus1)
Description:
EBI_100271
Residue:
490
  
Inhibitor
Name:
BDBM93927
Synonyms:
MLS002702060 cid_299645
Type:
Small organic molecule
Emp. Form.:
C26H32O11
Mol. Mass.:
520.5257
SMILES:
[#6]-[#8]-[#6](=O)C12[#8]-[#6]C34[#6]1-[#6](-[#8]-[#6](=O)\[#6]=[#6](\[#6])-[#6])-[#6](=O)-[#8]-[#6]3-[#6]-[#6]1-[#6](-[#6])=[#6](-[#8])-[#6](=O)-[#6]C1([#6])[#6]4-[#6](-[#8])-[#6]2-[#8]
: