Target
Nuclear hormone receptor family member daf-12
Ligand
BDBM43774
Substrate
Meas. Tech.
Luminescence-based cell-based high throughput dose response assay to identify activators of the DAF-12 from the parasite S. stercoralis (ssDAF-12)
IC50
67491±n/a nM
Citation
 PubChem, PC Luminescence-based cell-based high throughput dose response assay to identify activators of the DAF-12 from the parasite S. stercoralis (ssDAF-12) PubChem Bioassay (2013)[AID] 
Target
Name:
Nuclear hormone receptor family member daf-12
Synonyms:
DAF12_CAEEL XL285 daf-20 | mig-7
Type:
Enzyme Catalytic Domain
Mol. Mass.:
84211.49
Organism:
Caenorhabditis elegans
Description:
gi_71987181
Residue:
753
  
Inhibitor
Name:
BDBM43774
Synonyms:
MLS001017252 N-[4-[(1,3-benzothiazol-2-ylhydrazinylidene)methyl]phenyl]ethanamide N-[4-[(E)-(1,3-benzothiazol-2-ylhydrazono)methyl]phenyl]acetamide cid_220697
Type:
Small organic molecule
Emp. Form.:
C16H14N4OS
Mol. Mass.:
310.374
SMILES:
CC(=O)Nc1ccc(CN=Nc2nc3ccccc3s2)cc1
: