Target
Oxysterols receptor LXR-beta
Ligand
BDBM49908
Substrate
Meas. Tech.
Counterscreen for agonists of the daf-12 abnormal Dauer Formation: Luminescence-based cell-based dose response assay to identify agonists of the Liver-X-Receptor (LXR).
EC50
67529±n/a nM
Citation
 PubChem, PC Counterscreen for agonists of the daf-12 abnormal Dauer Formation: Luminescence-based cell-based dose response assay to identify agonists of the Liver-X-Receptor (LXR). PubChem Bioassay (2013)[AID] 
Target
Name:
Oxysterols receptor LXR-beta
Synonyms:
LXRB Liver X, LXR beta NR1H2 Nuclear receptor NER Ubiquitously-expressed nuclear receptor
Type:
Enzyme Catalytic Domain
Mol. Mass.:
50978.79
Organism:
Homo sapiens (Human)
Description:
P55055
Residue:
460
  
Inhibitor
Name:
BDBM49908
Synonyms:
2-(3-nitro-2-pyridinyl)-4-(4-propan-2-ylphenyl)-1,2,4-triazol-3-one 2-(3-nitropyridin-2-yl)-4-(4-propan-2-ylphenyl)-1,2,4-triazol-3-one MLS000764220 cid_1480901
Type:
Small organic molecule
Emp. Form.:
C16H15N5O3
Mol. Mass.:
325.322
SMILES:
CC(C)c1ccc(cc1)-n1cnn(-c2ncccc2[N+]([O-])=O)c1=O
: