Target
Oxysterols receptor LXR-beta
Ligand
BDBM93915
Substrate
Meas. Tech.
Counterscreen for agonists of the daf-12 abnormal Dauer Formation: Luminescence-based cell-based dose response assay to identify agonists of the Liver-X-Receptor (LXR).
EC50
67602±n/a nM
Citation
 PubChem, PC Counterscreen for agonists of the daf-12 abnormal Dauer Formation: Luminescence-based cell-based dose response assay to identify agonists of the Liver-X-Receptor (LXR). PubChem Bioassay (2013)[AID] 
Target
Name:
Oxysterols receptor LXR-beta
Synonyms:
LXRB Liver X, LXR beta NR1H2 Nuclear receptor NER Ubiquitously-expressed nuclear receptor
Type:
Enzyme Catalytic Domain
Mol. Mass.:
50978.79
Organism:
Homo sapiens (Human)
Description:
P55055
Residue:
460
  
Inhibitor
Name:
BDBM93915
Synonyms:
2-[2-(2,4-dichlorophenyl)ethenyl]pyridine MLS002637619 cid_220147
Type:
Small organic molecule
Emp. Form.:
C13H9Cl2N
Mol. Mass.:
250.123
SMILES:
Clc1ccc(C=Cc2ccccn2)c(Cl)c1
: