Target
Oxysterols receptor LXR-beta
Ligand
BDBM114821
Substrate
Meas. Tech.
Counterscreen for agonists of the daf-12 abnormal Dauer Formation: Luminescence-based cell-based dose response assay to identify agonists of the Liver-X-Receptor (LXR).
EC50
67508±n/a nM
Citation
 PubChem, PC Counterscreen for agonists of the daf-12 abnormal Dauer Formation: Luminescence-based cell-based dose response assay to identify agonists of the Liver-X-Receptor (LXR). PubChem Bioassay (2013)[AID] 
Target
Name:
Oxysterols receptor LXR-beta
Synonyms:
LXRB Liver X, LXR beta NR1H2 Nuclear receptor NER Ubiquitously-expressed nuclear receptor
Type:
Enzyme Catalytic Domain
Mol. Mass.:
50978.79
Organism:
Homo sapiens (Human)
Description:
P55055
Residue:
460
  
Inhibitor
Name:
BDBM114821
Synonyms:
2-(4-fluorophenyl)-5-(2-naphthalenyl)-1,3,4-oxadiazole 2-(4-fluorophenyl)-5-naphthalen-2-yl-1,3,4-oxadiazole SMR001560891 | cid_96845
Type:
Small organic molecule
Emp. Form.:
C18H11FN2O
Mol. Mass.:
290.2911
SMILES:
Fc1ccc(cc1)-c1nnc(o1)-c1ccc2ccccc2c1
: