Target
PC4 and SFRS1-interacting protein
Ligand
BDBM60722
Substrate
Meas. Tech.
Counterscreen for inhibitors of LEDGF/p75-dependent integration: TR-FRET-based biochemical high throughput dose response counterscreen assay to identify activators of HIV-1 Integrase multimerization
IC50
2619±n/a nM
Citation
 PubChem, PC Counterscreen for inhibitors of LEDGF/p75-dependent integration: TR-FRET-based biochemical high throughput dose response counterscreen assay to identify activators of HIV-1 Integrase multimerization PubChem Bioassay (2014)[AID] 
Target
Name:
PC4 and SFRS1-interacting protein
Synonyms:
DFS70 LEDGF/p75 PSIP1_HUMAN lens epithelium-derived growth factor p75
Type:
Enzyme Catalytic Domain
Mol. Mass.:
60120.68
Organism:
Homo sapiens (Human)
Description:
gi_6708281
Residue:
530
  
Inhibitor
Name:
BDBM60722
Synonyms:
5,7-dihydroxy-2-(4-hydroxyphenyl)-6-(3,4,5-trihydroxy-6-methylol-tetrahydropyran-2-yl)chromone 5,7-dihydroxy-2-(4-hydroxyphenyl)-6-[3,4,5-trihydroxy-6-(hydroxymethyl)oxan-2-yl]chromen-4-one MLS000877022 cid_4475102
Type:
Small organic molecule
Emp. Form.:
C21H20O10
Mol. Mass.:
432.3775
SMILES:
OCC1OC(C(O)C(O)C1O)c1c(O)cc2oc(cc(=O)c2c1O)-c1ccc(O)cc1
: