Target
PC4 and SFRS1-interacting protein
Ligand
BDBM53380
Substrate
Meas. Tech.
Counterscreen for inhibitors of LEDGF/p75-dependent integration: TR-FRET-based biochemical high throughput dose response counterscreen assay to identify activators of HIV-1 Integrase multimerization
IC50
833.7±n/a nM
Citation
 PubChem, PC Counterscreen for inhibitors of LEDGF/p75-dependent integration: TR-FRET-based biochemical high throughput dose response counterscreen assay to identify activators of HIV-1 Integrase multimerization PubChem Bioassay (2014)[AID] 
Target
Name:
PC4 and SFRS1-interacting protein
Synonyms:
DFS70 LEDGF/p75 PSIP1_HUMAN lens epithelium-derived growth factor p75
Type:
Enzyme Catalytic Domain
Mol. Mass.:
60120.68
Organism:
Homo sapiens (Human)
Description:
gi_6708281
Residue:
530
  
Inhibitor
Name:
BDBM53380
Synonyms:
MLS001332477 Sennoside A | cid_16218404
Type:
Small organic molecule
Emp. Form.:
C42H38O20
Mol. Mass.:
862.7391
SMILES:
[H][C@]1(c2cccc(OC3O[C@H](CO)[C@@H](O)[C@H](O)[C@H]3O)c2C(=O)c2c(O)cc(cc12)C(O)=O)[C@]1([H])c2cccc(O[C@@H]3O[C@H](CO)[C@@H](O)[C@H](O)[C@H]3O)c2C(=O)c2c(O)cc(cc12)C(O)=O
: