Target
PC4 and SFRS1-interacting protein
Ligand
BDBM53139
Substrate
Meas. Tech.
TR-FRET-based biochemical high throughput dose response assay to identify inhibitors of HIV-1 LEDGF/p75 DNA Integration
IC50
1267±n/a nM
Citation
 PubChem, PC TR-FRET-based biochemical high throughput dose response assay to identify inhibitors of HIV-1 LEDGF/p75 DNA Integration PubChem Bioassay (2014)[AID] 
Target
Name:
PC4 and SFRS1-interacting protein
Synonyms:
DFS70 LEDGF/p75 PSIP1_HUMAN lens epithelium-derived growth factor p75
Type:
Enzyme Catalytic Domain
Mol. Mass.:
60120.68
Organism:
Homo sapiens (Human)
Description:
gi_6708281
Residue:
530
  
Inhibitor
Name:
BDBM53139
Synonyms:
4-[[(E)-3-(2-furyl)acryloyl]thiocarbamoylamino]benzoic acid 4-[[[[(E)-3-(2-furanyl)-1-oxoprop-2-enyl]amino]-sulfanylidenemethyl]amino]benzoic acid SMR000539235 | cid_947839
Type:
Small organic molecule
Emp. Form.:
C15H12N2O4S
Mol. Mass.:
316.332
SMILES:
OC(=O)c1ccc(NC(=S)NC(=O)C=Cc2ccco2)cc1
: