Target
cAMP-specific 3',5'-cyclic phosphodiesterase 7B
Ligand
BDBM116309
Substrate
Meas. Tech.
Scintillation Proximity Assay
pH
8±n/a
IC50
4.8±n/a nM
Comments
extracted
Citation
 Bergmann, JECutshall, NSDemopulos, GAFlorio, VAGaitanaris, GGray, PHohmann, JOnrust, RZeng, H Use of PDE7 inhibitors for the treatment of movement disorders US Patent  US8637528 Publication Date 1/28/2014 
Target
Name:
cAMP-specific 3',5'-cyclic phosphodiesterase 7B
Synonyms:
3',5'-cyclic phosphodiesterase PDE7B_HUMAN Phosphodiesterase 7B (PDE7B) | cAMP-specific 3',5'-cyclic phosphodiesterase 7B
Type:
Enzyme
Mol. Mass.:
51842.76
Organism:
Homo sapiens (Human)
Description:
Q9NP56
Residue:
450
  
Inhibitor
Name:
BDBM116309
Synonyms:
US8637528, OM69
Type:
Small organic molecule
Emp. Form.:
C20H25N4O2
Mol. Mass.:
353.4376
SMILES:
COc1cc(N)ccc1-c1cc2c(C(N=[N+]2C)C2CCCCC2)c(=O)[nH]1
: