Target
Aldehyde dehydrogenase, mitochondrial
Ligand
BDBM118197
Substrate
Meas. Tech.
ALDH2 Assay
pH
7.4±n/a
IC50
47±n/a nM
Comments
extracted
Citation
 Graupe, MVenkataramani, CZablocki, J ALDH-2 inhibitors in the treatment of addiction US Patent  US8673966 Publication Date 3/18/2014 
Target
Name:
Aldehyde dehydrogenase, mitochondrial
Synonyms:
ALDH class 2 ALDH2 ALDHI Aldehyde dehydrogenase (ALDH2)
Type:
Enzyme
Mol. Mass.:
56382.67
Organism:
Homo sapiens (Human)
Description:
P05091
Residue:
517
  
Inhibitor
Name:
BDBM118197
Synonyms:
US8673966, N-(4-(7-(3-methoxyprop-1-ynyl)-4-oxo-4H- chromen-3-yl)phenyl)methanesulfonamide
Type:
Emp. Form.:
C20H17NO5S
Mol. Mass.:
383.418
SMILES:
COCC#Cc1ccc2c(c1)occ(-c1ccc(NS(C)(=O)=O)cc1)c2=O
: