Target
Sphingosine 1-phosphate receptor 1
Ligand
BDBM123449
Substrate
Meas. Tech.
Binding Assay
pH
7.4±n/a
Temperature
277.15±n/a K
Ki
5±n/a nM
Comments
extracted
Citation
 Muzerelle, MQuattropani, AMontagne, CDorbais, J Oxadiazole fused heterocyclic derivatives useful for the treatment of multiple sclerosis US Patent  US8741923 Publication Date 6/3/2014 
Target
Name:
Sphingosine 1-phosphate receptor 1
Synonyms:
CHEDG1 Endothelial differentiation G-protein coupled receptor 1 S1P1 S1PR1_HUMAN Sphingosine 1-phosphate receptor Edg-1
Type:
Enzyme
Mol. Mass.:
42836.02
Organism:
Homo sapiens (Human)
Description:
P21453
Residue:
382
  
Inhibitor
Name:
BDBM123449
Synonyms:
US8741923, 1
Type:
Small organic molecule
Emp. Form.:
C22H20F3N5O
Mol. Mass.:
427.4223
SMILES:
CC1CCCCN1c1ccc(cc1C(F)(F)F)-c1nc(no1)-c1ccc2nc[nH]c2c1
: