Target
Sphingosine 1-phosphate receptor 1
Ligand
BDBM123463
Substrate
Meas. Tech.
Binding Assay
pH
7.4±n/a
Temperature
277.15±n/a K
Ki
0.49±n/a nM
Comments
extracted
Citation
 Muzerelle, MQuattropani, AMontagne, CDorbais, J Oxadiazole fused heterocyclic derivatives useful for the treatment of multiple sclerosis US Patent  US8741923 Publication Date 6/3/2014 
Target
Name:
Sphingosine 1-phosphate receptor 1
Synonyms:
CHEDG1 Endothelial differentiation G-protein coupled receptor 1 S1P1 S1PR1_HUMAN Sphingosine 1-phosphate receptor Edg-1
Type:
Enzyme
Mol. Mass.:
42836.02
Organism:
Homo sapiens (Human)
Description:
P21453
Residue:
382
  
Inhibitor
Name:
BDBM123463
Synonyms:
US8741923, 36
Type:
Small organic molecule
Emp. Form.:
C27H22F3N3O3
Mol. Mass.:
493.4771
SMILES:
Cc1ccccc1-c1ccc(cc1C(F)(F)F)-c1nc(no1)-c1ccc2CCN(CC(O)=O)Cc2c1
: