Target
Transthyretin
Ligand
BDBM50091
Substrate
Meas. Tech.
Luminescence-based cell-based high throughput dose response assay to identify activators of Transthyretin (TTR) transcription
EC50
>167158±n/a nM
Citation
 PubChem, PC Luminescence-based cell-based high throughput dose response assay to identify activators of Transthyretin (TTR) transcription PubChem Bioassay (2014)[AID] 
Target
Name:
Transthyretin
Synonyms:
ATTR Prealbumin TTHY_HUMAN Transthyretin (TTR)
Type:
Enzyme
Mol. Mass.:
15884.31
Organism:
Homo sapiens (Human)
Description:
P02766
Residue:
147
  
Inhibitor
Name:
BDBM50091
Synonyms:
4-(4-ethoxyanilino)-5-[(4-oxo-1-cyclohexa-2,5-dienylidene)methyl]-3H-thiazol-2-one 4-[(4-ethoxyphenyl)amino]-5-[(4-oxidanylidenecyclohexa-2,5-dien-1-ylidene)methyl]-3H-1,3-thiazol-2-one 5-[(4-ketocyclohexa-2,5-dien-1-ylidene)methyl]-4-(p-phenetidino)-4-thiazolin-2-one SMR000145427 | cid_5398488
Type:
Small organic molecule
Emp. Form.:
C18H16N2O3S
Mol. Mass.:
340.396
SMILES:
CCOc1ccc(Nc2[nH]c(=O)sc2C=C2C=CC(=O)C=C2)cc1
: