Target
Fatty acid-binding protein, intestinal
Ligand
BDBM85511
Substrate
Meas. Tech.
Fluorophore Displacement Assay
Temperature
566.3±0 K
Ki
9.4e+3± 5.4e+3 nM
Citation
 Patil, RLaguerre, AWielens, JHeadey, SJWilliams, MLHughes, MLMohanty, BPorter, CJScanlon, MJ Characterization of two distinct modes of drug binding to human intestinal fatty acid binding protein. ACS Chem Biol 9:2526-34 (2014)  
Target
Name:
Fatty acid-binding protein, intestinal
Synonyms:
FABP2 FABPI_HUMAN Fatty acid-binding protein, intestinal Intestinal fatty acid-binding protein (hIFABP)
Type:
Protein
Mol. Mass.:
15207.56
Organism:
Homo sapiens (Human)
Description:
Residue:
132
  
Inhibitor
Name:
BDBM85511
Synonyms:
CAS_74103-07-4 Ketorolac tris salt | Toradol
Type:
Small organic molecule
Emp. Form.:
C15H13NO3
Mol. Mass.:
255.2686
SMILES:
OC(=O)C1CCn2c1ccc2C(=O)c1ccccc1
: