Target
Serine/threonine-protein kinase TBK1
Ligand
BDBM2590
Substrate
Meas. Tech.
KinEASE-STK Assay
IC50
2.69e+3± 679 nM
Citation
 Richters, ABasu, DEngel, JErcanoglu, MSBalke-Want, HTesch, RThomas, RKRauh, D Identification and further development of potent TBK1 inhibitors. ACS Chem Biol 10:289-98 (2015)  
Target
Name:
Serine/threonine-protein kinase TBK1
Synonyms:
NAK Protein cereblon/Serine/threonine-protein kinase TBK1 TANK-binding kinase 1 (TBK-1) TBK1 | TBK1_HUMAN
Type:
protein
Mol. Mass.:
83645.20
Organism:
Homo sapiens (Human)
Description:
Q9UHD2
Residue:
729
  
Inhibitor
Name:
BDBM2590
Synonyms:
(Arylindolyl)maleimide deriv. 12 ROCHE screening, 40 | bis-indolylmaleimide deriv. 8g
Type:
Small organic molecule
Emp. Form.:
C21H15N3O2
Mol. Mass.:
341.3627
SMILES:
Cn1cc(C2=C(C(=O)NC2=O)c2c[nH]c3ccccc23)c2ccccc12
: