Target
Serine/threonine-protein kinase TBK1
Ligand
BDBM3165
Substrate
Meas. Tech.
KinEASE-STK Assay
IC50
1.20e+3± 8 nM
Citation
 Richters, ABasu, DEngel, JErcanoglu, MSBalke-Want, HTesch, RThomas, RKRauh, D Identification and further development of potent TBK1 inhibitors. ACS Chem Biol 10:289-98 (2015)  
Target
Name:
Serine/threonine-protein kinase TBK1
Synonyms:
NAK Protein cereblon/Serine/threonine-protein kinase TBK1 TANK-binding kinase 1 (TBK-1) TBK1 | TBK1_HUMAN
Type:
protein
Mol. Mass.:
83645.20
Organism:
Homo sapiens (Human)
Description:
Q9UHD2
Residue:
729
  
Inhibitor
Name:
BDBM3165
Synonyms:
3-[1-(4-hydroxybutyl)-1H-indol-3-yl]-4-(1-methyl-1H-indol-3-yl)-2,5-dihydro-1H-pyrrole-2,5-dione ROCHE screening, 50
Type:
Small organic molecule
Emp. Form.:
C25H23N3O3
Mol. Mass.:
413.4684
SMILES:
Cn1cc(C2=C(C(=O)NC2=O)c2cn(CCCCO)c3ccccc23)c2ccccc12
: