Target
Orexin/Hypocretin receptor type 1
Ligand
BDBM154927
Substrate
Meas. Tech.
In Vitro Assay
Temperature
310.15±n/a K
IC50
21±n/a nM
Comments
extracted
Citation
 Boss, CBrotschi, CGatfield, JGude, MHeidmann, BSifferlen, TWilliams, JT Proline sulfonamide derivatives as orexin receptor antagonists US Patent  US9000029 Publication Date 4/7/2015 
Target
Name:
Orexin/Hypocretin receptor type 1
Synonyms:
HCRTR1 OX1R_HUMAN Orexin receptor type 1 (OR 1) Orexin receptor type 1 (OX1) Orexin receptor type 1 (OxR1) | Ox1r
Type:
Protein
Mol. Mass.:
47554.50
Organism:
Homo sapiens (Human)
Description:
O43613
Residue:
425
  
Inhibitor
Name:
BDBM154927
Synonyms:
US9000029, 6
Type:
Small organic molecule
Emp. Form.:
C19H22N2O4S2
Mol. Mass.:
406.519
SMILES:
COc1ccc(cc1)S(=O)(=O)N1CCC[C@H]1C(=O)Nc1cccc(SC)c1
: