Target
Fibroblast growth factor receptor 1
Ligand
BDBM287529
Substrate
Meas. Tech.
Caliper-Based Kinase Assay
Temperature
298.15±n/a K
IC50
0.900±n/a nM
Comments
extracted
Citation
 Verner, EBrameld, KA Quinolone derivatives as fibroblast growth factor receptor inhibitors US Patent  US9567334 Publication Date 2/14/2017 
Target
Name:
Fibroblast growth factor receptor 1
Synonyms:
BFGFR Basic fibroblast growth factor receptor 1 (FGFR1) CEK FGFR-1 FGFR-1, (FL) FGFR1_HUMAN FLT2 Fibroblast growth factor receptor 1 (FGFR-1) Fms-like tyrosine kinase 2 N-sam bFGF-R | c-fgr
Type:
Receptor
Mol. Mass.:
91861.70
Organism:
Homo sapiens (Human)
Description:
P11362
Residue:
822
  
Inhibitor
Name:
BDBM287529
Synonyms:
8-(2-((1-acryloylazetidin-3-yl)amino)ethyl)-6-(2,6-dichloro-3,5-dimethoxyphenyl)-2-(methylamino)pyrido[2,3-d]pyrimidin-7(8H)-one US11078199, Cpd 117 | US9567334, Example 117
Type:
Small organic molecule
Emp. Form.:
C24H26Cl2N6O4
Mol. Mass.:
533.407
SMILES:
CNc1ncc2cc(-c3c(Cl)c(OC)cc(OC)c3Cl)c(=O)n(CCNC3CN(C3)C(=O)C=C)c2n1
: