Target
Gag-Pol polyprotein
Ligand
BDBM60467
Substrate
Meas. Tech.
Inhibition Assay
IC50
0.03±n/a nM
Citation
 Boyd, MJMolinaro, CRoy, ATruong, V HIV protease inhibitors US Patent  US9079834 Publication Date 7/14/2015 
Target
Name:
Gag-Pol polyprotein
Synonyms:
HIV-1 reverse transcriptase (HIV-1 RT) POL_HV1H2 Protease Reverse transcriptase (RT) gag-pol p66 RT
Type:
Protein
Mol. Mass.:
162074.74
Organism:
Human immunodeficiency virus type 1 group M subtype B (isolate HXB2)
Description:
P04585
Residue:
1435
  
Inhibitor
Name:
BDBM60467
Synonyms:
BDBM168607 | US9079834, 1-1
Type:
Emp. Form.:
C34H45FN4O6S
Mol. Mass.:
656.808
SMILES:
COC(=O)N[C@@H](C(c1ccccc1)c1ccccc1)C(=O)NCC(F)CC[C@@H](CO)N(CCC(C)C)S(=O)(=O)c1ccc(N)cc1
: