Target
3-hydroxy-3-methylglutaryl-coenzyme A reductase
Ligand
BDBM155381
Substrate
Meas. Tech.
Reductase Assay
IC50
2±n/a nM
Citation
 Lindsay, DJackson, P Use of rosuvastatin lactols as medicaments US Patent  US9102656 Publication Date 8/11/2015 
Target
Name:
3-hydroxy-3-methylglutaryl-coenzyme A reductase
Synonyms:
3-hydroxy-3-methylglutaryl-coenzyme A (HMG-CoA) reductase HMDH_HUMAN HMG-CoA reductase (HMGR) | HMGCR
Type:
Enzyme
Mol. Mass.:
97477.10
Organism:
Homo sapiens (Human)
Description:
P04035
Residue:
888
  
Inhibitor
Name:
BDBM155381
Synonyms:
US9006282, Example 2, Compound 9 | US9102656, Example 2, Compound 9
Type:
Small organic molecule
Emp. Form.:
C30H36FN3O7S
Mol. Mass.:
601.686
SMILES:
COc1ccc(OC2C[C@H](O)C[C@H](O2)\C=C\c2c(nc(nc2-c2ccc(F)cc2)N(C)S(C)(=O)=O)C(C)C)c(OC)c1
: