Target
Apoptosis regulator Bcl-2
Ligand
BDBM178891
Substrate
Meas. Tech.
Time Resolved-Fluorescence Resonance Energy Transfer (TR-FRET) Assay
Ki
0.007±n/a nM
Citation
 Bruncko, MDing, HDoherty, GAElmore, SWHasvold, LHexamer, LAKunzer, ARMantei, RAMcClellan, WJPark, CHPark, CPetros, AMSong, XSouers, AJSullivan, GMTao, ZWang, GTWang, LWang, XWendt, MD Bcl-2-selective apoptosis-inducing agents for the treatment of cancer and immune diseases US Patent  US9125913 Publication Date 9/8/2015 
Target
Name:
Apoptosis regulator Bcl-2
Synonyms:
BCL2_MOUSE Bcl2
Type:
Protein
Mol. Mass.:
26409.44
Organism:
Mus musculus (Mouse)
Description:
P10417
Residue:
236
  
Inhibitor
Name:
BDBM178891
Synonyms:
US9125913, 463
Type:
Small organic molecule
Emp. Form.:
C45H48Cl2F2N6O5S
Mol. Mass.:
893.868
SMILES:
CC1(C)CCC(CN2CCN(CC2)c2ccc(C(=O)NS(=O)(=O)c3cnc(OCC4CCC(F)(F)CC4)c(Cl)c3)c(Oc3cccc4[nH]cnc34)c2)=C(C1)c1ccc(Cl)cc1
: