Target
Mitogen-activated protein kinase 1
Ligand
BDBM180929
Substrate
Meas. Tech.
Enzymatic Assay
pH
7.3±n/a
IC50
1.1±n/a nM
Comments
extracted
Citation
 Blake, JFChen, HChicarelli, MJDemeese, JGarrey, RGaudino, JJKaus, RJKolakowski, GRMarlow, ALMohr, PJRen, LSchwarz, JSiedem, CSThomas, AAWallace, EWenglowsky, SMBoyd, S Serine/threonine kinase inhibitors US Patent  US9133187 Publication Date 9/15/2015 
Target
Name:
Mitogen-activated protein kinase 1
Synonyms:
ERK2 Extracellular signal-regulated kinase 2 Extracellular signal-regulated kinase 2 (ERK2) MAPK 2 MK01_HUMAN Mitogen-activated protein kinase 1 (ERK-2) Mitogen-activated protein kinase 2 PRKM2 | p42-MAPK
Type:
Ser/Thr Protein Kinase
Mol. Mass.:
41392.76
Organism:
Homo sapiens (Human)
Description:
P28482
Residue:
360
  
Inhibitor
Name:
BDBM180929
Synonyms:
US9133187, I-1
Type:
Small organic molecule
Emp. Form.:
C23H24Cl2N6O3
Mol. Mass.:
503.381
SMILES:
Clc1ccc(cc1Cl)[C@H](NC(=O)N1CCc2cnc(NC3CCOCC3)nc2C1)c1cnco1
: