Target
Mitogen-activated protein kinase 1
Ligand
BDBM181007
Substrate
Meas. Tech.
Enzymatic Assay
pH
7.3±n/a
IC50
3.03±n/a nM
Comments
extracted
Citation
 Blake, JFChen, HChicarelli, MJDemeese, JGarrey, RGaudino, JJKaus, RJKolakowski, GRMarlow, ALMohr, PJRen, LSchwarz, JSiedem, CSThomas, AAWallace, EWenglowsky, SMBoyd, S Serine/threonine kinase inhibitors US Patent  US9133187 Publication Date 9/15/2015 
Target
Name:
Mitogen-activated protein kinase 1
Synonyms:
ERK2 Extracellular signal-regulated kinase 2 Extracellular signal-regulated kinase 2 (ERK2) MAPK 2 MK01_HUMAN Mitogen-activated protein kinase 1 (ERK-2) Mitogen-activated protein kinase 2 PRKM2 | p42-MAPK
Type:
Ser/Thr Protein Kinase
Mol. Mass.:
41392.76
Organism:
Homo sapiens (Human)
Description:
P28482
Residue:
360
  
Inhibitor
Name:
BDBM181007
Synonyms:
US9133187, II-399
Type:
Small organic molecule
Emp. Form.:
C22H29Cl2N5O3
Mol. Mass.:
482.403
SMILES:
COCCC[C@@H](CO)Nc1ncc2CCN(Cc2n1)C(=O)N[C@H](C)c1ccc(Cl)c(Cl)c1
: