Target
Sterol O-acyltransferase 1
Ligand
BDBM182849
Substrate
Meas. Tech.
Inhibition Assay
IC50
4.2±n/a nM
Citation
 Chang, TChang, CCShibuya, YBryleva, EMurphy, SRogers, MA Method for selectively inhibiting ACAT1 in the treatment of alzheimer's disease US Patent  US9149492 Publication Date 10/6/2015 
Target
Name:
Sterol O-acyltransferase 1
Synonyms:
ACACT ACAT Acetyl-CoA acetyltransferase, mitochondrial Acyl-CoA: cholesterol acyltransferase (ACAT) Cholesterol acyltransferase 1 SOAT1 STAT
Type:
Multi-pass membrane protein may form homo- or heterodimers.
Mol. Mass.:
64751.94
Organism:
Homo sapiens (Human)
Description:
P35610
Residue:
550
  
Inhibitor
Name:
BDBM182849
Synonyms:
US9149492, Compound 1A
Type:
Small organic molecule
Emp. Form.:
C30H35NO2
Mol. Mass.:
441.6044
SMILES:
CC(C)c1cccc(C(C)C)c1NC(=O)CC(=O)C(Cc1ccccc1)Cc1ccccc1
: