Target
Cell division cycle 7-related protein kinase
Ligand
BDBM185842
Substrate
Meas. Tech.
Inhibition Assay
pH
7.5±n/a
Ki
17±n/a nM
Comments
extracted
Target
Name:
Cell division cycle 7-related protein kinase
Synonyms:
CDC7 CDC7L1 Cell division cycle 7-related protein kinase (CDC7) huCdc7
Type:
Protein
Mol. Mass.:
63908.16
Organism:
Homo sapiens (Human)
Description:
O00311
Residue:
574
  
Inhibitor
Name:
BDBM185842
Synonyms:
US9163007, 123
Type:
Small organic molecule
Emp. Form.:
C17H16N6
Mol. Mass.:
304.3491
SMILES:
Cc1c(nnn1Cc1ccccc1)-c1ccc2[nH]nc(N)c2c1
: