Target
Serum paraoxonase/arylesterase 1
Ligand
BDBM36351
Substrate
Meas. Tech.
Paraoxonase Activity Assay
pH
10.5±n/a
Ki
2.91e+5± 1.08e+5 nM
IC50
6.65e+5±n/a nM
Comments
extracted
Citation
 Alim, ZBeydemir, S Some Anticancer Agents Act on Human Serum Paraoxonase-1 to Reduce Its Activity. Chem Biol Drug Des 88:188-96 (2016)  
Target
Name:
Serum paraoxonase/arylesterase 1
Synonyms:
A-esterase 1 K-45 PON 1 PON1_HUMAN Paraoxonase (hPON1) Serum aryldialkylphosphatase 1 | Serum paraoxonase 1 (PON1)
Type:
Enzyme
Mol. Mass.:
39719.73
Organism:
Homo sapiens (Human)
Description:
P27169
Residue:
355
  
Inhibitor
Name:
BDBM36351
Synonyms:
CID148124 | Docetaxel
Type:
Small organic molecule
Emp. Form.:
C43H53NO14
Mol. Mass.:
807.8792
SMILES:
[H][C@]12[C@H](OC(=O)c3ccccc3)[C@]3(O)C[C@H](OC(=O)[C@H](O)[C@@H](NC(=O)OC(C)(C)C)c4ccccc4)C(C)=C([C@@H](O)C(=O)[C@]1(C)[C@@H](O)C[C@H]1OC[C@@]21OC(C)=O)C3(C)C
: