Target
Lysine-specific demethylase 5A [1-1090]
Ligand
BDBM191599
Substrate
Meas. Tech.
AlphaLISA Assay
pH
7.2±n/a
Temperature
298.15±n/a K
IC50
303± 3 nM
Comments
extracted
Citation
 Horton, JRLiu, XGale, MWu, LShanks, JRZhang, XWebber, PJBell, JSKales, SCMott, BTRai, GJansen, DJHenderson, MJUrban, DJHall, MDSimeonov, AMaloney, DJJohns, MAFu, HJadhav, AVertino, PMYan, QCheng, X Structural Basis for KDM5A Histone Lysine Demethylase Inhibition by Diverse Compounds. Cell Chem Biol 23:769-81 (2016)  
Target
Name:
Lysine-specific demethylase 5A [1-1090]
Synonyms:
JARID1A KDM5A_HUMAN Lysine-specific demethylase 5A (KDM5Flag-KDM5A-FL) RBP2
Type:
Protein
Mol. Mass.:
124246.30
Organism:
Homo sapiens (Human)
Description:
Truncation 1-1090aa
Residue:
1090
  
Inhibitor
Name:
BDBM191599
Synonyms:
KDOAM-21 | ethyl 2-(((2-((2-(dimethylamino)ethyl)(ethyl)amino)-2-oxoethyl)amino)methyl)isonicotinate (KDM5-C70)
Type:
Small organic molecule
Emp. Form.:
C17H28N4O3
Mol. Mass.:
336.4292
SMILES:
CCOC(=O)c1ccnc(CNCC(=O)N(CC)CCN(C)C)c1
: