Target
ATP-sensitive inward rectifier potassium channel 1
Ligand
BDBM194967
Substrate
Meas. Tech.
Electrophysiology Assay
pH
7.4±n/a
Temperature
310.15±n/a K
IC50
4±n/a nM
Comments
extracted
Citation
 Ding, FDong, SFrie, JGu, XJiang, JPasternak, ATang, HWu, ZYu, YSuzuki, T Inhibitors of the renal outer medullary potassium channel US Patent  US9206198 Publication Date 12/8/2015 
Target
Name:
ATP-sensitive inward rectifier potassium channel 1
Synonyms:
ATP-regulated potassium channel ROM-K ATP-sensitive inward rectifier potassium channel 1 KCNJ1 Potassium channel (ATP modulatory) ROMK1 The Renal Outer Medullary Potassium (ROMK)
Type:
Enzyme Catalytic Domain
Mol. Mass.:
44809.08
Organism:
Homo sapiens (Human)
Description:
gi_223460826
Residue:
391
  
Inhibitor
Name:
BDBM194967
Synonyms:
US9206198, 22
Type:
Small organic molecule
Emp. Form.:
C23H25FN2O6
Mol. Mass.:
444.4528
SMILES:
Cc1c2COC(=O)c2ccc1[C@@H](O)CN1CCC2(CCN(C2=O)C2=C(F)C(=O)OC2)CC1
: