Target
D(1A) dopamine receptor
Ligand
BDBM160894
Substrate
Meas. Tech.
Human D1 Receptor Binding Assay
pH
7.4±n/a
Ki
4.17±n/a nM
Comments
extracted
Citation
 Brodney, MADavoren, JEDounay, ABEfremov, IVGray, DLGreen, MEHenderson, JLLee, CMente, SRO Neil, SVRogers, BNZhang, L Heteroaromatic compounds and their use as dopamine D1 ligands US Patent  US10093655 Publication Date 10/9/2018 
Target
Name:
D(1A) dopamine receptor
Synonyms:
DA D1 receptor DRD1 Dopamine D1 receptor Dopamine D1A
Type:
Enzyme
Mol. Mass.:
49303.43
Organism:
Homo sapiens (Human)
Description:
P21728
Residue:
446
  
Inhibitor
Name:
BDBM160894
Synonyms:
US10093655, Example 64 US9107923, 64
Type:
Small organic molecule
Emp. Form.:
C20H18F3N3O3
Mol. Mass.:
405.3704
SMILES:
COc1ccnc(Oc2ccc(c(C)c2)-c2c(C)n[nH]c(=O)c2C)c1C(F)(F)F
: