Target
Prostaglandin G/H synthase 2
Ligand
BDBM198176
Substrate
Meas. Tech.
Enzyme Kinetics Assay
Ki
8.8e+2±n/a nM
Citation
 Banerjee, AGDas, NShengule, SASharma, PASrivastava, RSShrivastava, SK Design, synthesis, evaluation and molecular modelling studies of some novel 5,6-diphenyl-1,2,4-triazin-3(2H)-ones bearing five-member heterocyclic moieties as potential COX-2 inhibitors: A hybrid pharmacophore approach. Bioorg Chem 69:102-120 (2016)  
Target
Name:
Prostaglandin G/H synthase 2
Synonyms:
COX2 Cyclooxygenase-2 (COX-2) PTGS2 Prostaglandin G/H synthase (cyclooxygenase)
Type:
Protein
Mol. Mass.:
68976.98
Organism:
Ovis aries (Sheep)
Description:
Residue:
603
  
Inhibitor
Name:
BDBM198176
Synonyms:
2-((5-(4-Nitrophenylamino)-1,3,4-thiadiazol-2-yl)methyl)-5,6-diphenyl-1,2,4-triazin-3(2H)-one (4e)
Type:
Small organic molecule
Emp. Form.:
C24H17N7O3S
Mol. Mass.:
483.502
SMILES:
[O-][N+](=O)c1ccc(Nc2nnc(Cn3nc(-c4ccccc4)c(nc3=O)-c3ccccc3)s2)cc1
: