Target
Cystic fibrosis transmembrane conductance regulator
Ligand
BDBM200239
Substrate
EC50
>61000±n/a nM
Citation
 PubChem, PC Phenotypic Assay to Identify Small Molecules that Upregulate Production of hCFTR in HeLa Cells PubChem Bioassay (2016)[AID] 
Target
Name:
Cystic fibrosis transmembrane conductance regulator
Synonyms:
ABCC7 CFTR Channel conductance-controlling ATPase | cAMP-dependent chloride channel
Type:
Enzyme Catalytic Domain
Mol. Mass.:
168171.30
Organism:
Homo sapiens (Human)
Description:
gi_90421313
Residue:
1480
  
Inhibitor
Name:
BDBM200239
Synonyms:
AB00723541-02 | cid_5827278
Type:
Small organic molecule
Emp. Form.:
C17H11FN2O2S
Mol. Mass.:
326.345
SMILES:
[O-][N+](=O)c1ccc(\C=C\c2nc(cs2)-c2ccc(F)cc2)cc1
: