Target
Cystic fibrosis transmembrane conductance regulator
Ligand
BDBM200280
Substrate
EC50
>53000±n/a nM
Citation
 PubChem, PC Phenotypic Assay to Identify Small Molecules that Upregulate Production of hCFTR in HeLa Cells PubChem Bioassay (2016)[AID] 
Target
Name:
Cystic fibrosis transmembrane conductance regulator
Synonyms:
ABCC7 CFTR Channel conductance-controlling ATPase | cAMP-dependent chloride channel
Type:
Enzyme Catalytic Domain
Mol. Mass.:
168171.30
Organism:
Homo sapiens (Human)
Description:
gi_90421313
Residue:
1480
  
Inhibitor
Name:
BDBM200280
Synonyms:
AB01004181-01 | cid_45898217
Type:
Small organic molecule
Emp. Form.:
C16H21N7O2S
Mol. Mass.:
375.449
SMILES:
Cn1cc(cn1)C(=O)NC1CCN(CC1)C(=O)Nc1nnc(s1)C1CC1
: