Target
Cystic fibrosis transmembrane conductance regulator
Ligand
BDBM200289
Substrate
EC50
>54000±n/a nM
Citation
 PubChem, PC Phenotypic Assay to Identify Small Molecules that Upregulate Production of hCFTR in HeLa Cells PubChem Bioassay (2016)[AID] 
Target
Name:
Cystic fibrosis transmembrane conductance regulator
Synonyms:
ABCC7 CFTR Channel conductance-controlling ATPase | cAMP-dependent chloride channel
Type:
Enzyme Catalytic Domain
Mol. Mass.:
168171.30
Organism:
Homo sapiens (Human)
Description:
gi_90421313
Residue:
1480
  
Inhibitor
Name:
BDBM200289
Synonyms:
AB01003541-01 | cid_33987850
Type:
Small organic molecule
Emp. Form.:
C18H19N3O2S2
Mol. Mass.:
373.492
SMILES:
Cc1nc(N2CCC3(CC2)OCCO3)c2c(csc2n1)-c1cccs1
: