Target
Cystic fibrosis transmembrane conductance regulator
Ligand
BDBM200234
Substrate
EC50
>50000±n/a nM
Citation
 PubChem, PC Phenotypic Assay to Identify Small Molecules that Upregulate Production of hCFTR in HeLa Cells PubChem Bioassay (2016)[AID] 
Target
Name:
Cystic fibrosis transmembrane conductance regulator
Synonyms:
ABCC7 CFTR Channel conductance-controlling ATPase | cAMP-dependent chloride channel
Type:
Enzyme Catalytic Domain
Mol. Mass.:
168171.30
Organism:
Homo sapiens (Human)
Description:
gi_90421313
Residue:
1480
  
Inhibitor
Name:
BDBM200234
Synonyms:
AB00053570_02 | cid_4068
Type:
Small organic molecule
Emp. Form.:
C20H9Br2HgO6
Mol. Mass.:
705.68
SMILES:
O.[O-]C(=O)c1ccccc1-c1c2cc(Br)c(=O)cc2oc2c([Hg])c([O-])c(Br)cc12
: