Target
Serine/threonine-protein kinase mTOR
Ligand
BDBM200300
Substrate
IC50
15±n/a nM
Citation
 PubChem, PC mTOR Inhibition with eCF309 PubChem Bioassay (2016)[AID] 
Target
Name:
Serine/threonine-protein kinase mTOR
Synonyms:
FK506-binding protein 12-rapamycin complex-associated protein 1 FRAP FRAP1 MTOR Mammalian Target of Rapamycin (mTOR) RAFT1 Rapamycin and FKBP12 target 1 Serine/threonine-protein kinase (mTOR) | mTORC2
Type:
Rapamycin target protein
Mol. Mass.:
288917.12
Organism:
Homo sapiens (Human)
Description:
P42345
Residue:
2549
  
Inhibitor
Name:
BDBM200300
Synonyms:
5-[4-amino-1-(2,2-diethoxyethyl)pyrazolo[3,4-d]pyrimidin-3-yl]-1,3-benzoxazol-2-amine | cid_122163152
Type:
Small organic molecule
Emp. Form.:
C18H21N7O3
Mol. Mass.:
383.4044
SMILES:
CCOC(Cn1nc(-c2ccc3oc(N)nc3c2)c2c(N)ncnc12)OCC
: