Target
Solute carrier organic anion transporter family member
Ligand
BDBM50206509
Substrate
Meas. Tech.
Oatp1d1 Transport Assay
Ki
2.60e+4±n/a nM
Citation
 Popovic, MZaja, RFent, KSmital, T Molecular characterization of zebrafish Oatp1d1 (Slco1d1), a novel organic anion-transporting polypeptide. J Biol Chem 288:33894-911 (2013)  
Target
Name:
Solute carrier organic anion transporter family member
Synonyms:
Organic anion-transporting polypeptide 1D1 (Oatp1d1)
Type:
Protein
Mol. Mass.:
75011.81
Organism:
Danio rerio (Zebrafish)
Description:
A0A8M9PU70
Residue:
689
  
Inhibitor
Name:
BDBM50206509
Synonyms:
4-Dipropylsulfamoyl-benzoic acid 4-Dipropylsulfamoyl-benzoic acid(probenecid) CHEMBL897 Probalan
Type:
Small organic molecule
Emp. Form.:
C13H19NO4S
Mol. Mass.:
285.359
SMILES:
CCCN(CCC)S(=O)(=O)c1ccc(cc1)C(O)=O
: