Target
Kappa-type opioid receptor [I135A]
Ligand
BDBM50159165
Substrate
Meas. Tech.
cAMP Inhibition Assay
pH
7.4±n/a
EC50
8.7±0.8 nM
Comments
extracted
Citation
 Vardy, EMosier, PDFrankowski, KJWu, HKatritch, VWestkaemper, RBAubé, JStevens, RCRoth, BL Chemotype-selective modes of action of ¿-opioid receptor agonists. J Biol Chem 288:34470-83 (2013)  
Target
Name:
Kappa-type opioid receptor [I135A]
Synonyms:
Kappa opioid receptor (KOR I135A) OPRK1 | OPRK_HUMAN
Type:
Protein
Mol. Mass.:
42606.68
Organism:
Homo sapiens (Human)
Description:
Human KOR with I135A mutation
Residue:
380
  
Inhibitor
Name:
BDBM50159165
Synonyms:
(2S,4aR,6aR,7R,9S,10aS,10bR)-9-(acetyloxy)-2-(furan-3-yl)dodecahydro-6a,10b-dimethyl-4,10-dioxo-2H-naphtho-[2,1-c]pyran-7-carboxylic acid methyl ester (2S,4aR,6aR,7R,9S,10aS,10bR)-methyl 9-acetoxy-2-(furan-3-yl)-6a,10b-dimethyl-4,10-dioxo-dodecahydro-1H-benzo[f]isochromene-7-carboxylate 2S,4aR,6a(R,7R,9S,10aS,10bR)-9-(acetyloxy)-2-(furan-3-yl)dodecahydro-6a,10b-dimethyl-4,10-dioxo-2H-naphtho[2,1-c]pyran-7-carboxylic acid methyl ester Salvinorin A salvinorin-A
Type:
Small organic molecule
Emp. Form.:
C23H28O8
Mol. Mass.:
432.4636
SMILES:
COC(=O)[C@@H]1C[C@H](OC(C)=O)C(=O)[C@H]2[C@@]1(C)CC[C@H]1C(=O)O[C@@H](C[C@]21C)c1ccoc1
: