Target
Kappa-type opioid receptor
Ligand
BDBM214798
Substrate
Meas. Tech.
cAMP Inhibition Assay
pH
7.4±n/a
EC50
4.8±0.7 nM
Comments
extracted
Citation
 Vardy, EMosier, PDFrankowski, KJWu, HKatritch, VWestkaemper, RBAubé, JStevens, RCRoth, BL Chemotype-selective modes of action of ¿-opioid receptor agonists. J Biol Chem 288:34470-83 (2013)  
Target
Name:
Kappa-type opioid receptor
Synonyms:
K-OR-1 Kappa-opioid receptor (KOR) Kappa-type opioid receptor (KOR) OPIATE Kappa OPRK1 kappa opioid receptor (KOR)
Type:
G Protein-Coupled Receptor (GPCR)
Mol. Mass.:
42648.76
Organism:
Homo sapiens (Human)
Description:
P41145
Residue:
380
  
Inhibitor
Name:
BDBM214798
Synonyms:
Dynorphin A (1-17) | YGGFLRRIRPKLK
Type:
Small organic molecule
Emp. Form.:
C75H126N24O15
Mol. Mass.:
1603.9547
SMILES:
CC[C@H](C)[C@H](NC(=O)[C@H](CCCNC(N)=N)NC(=O)[C@H](CCCNC(N)=N)NC(=O)[C@H](CC(C)C)NC(=O)[C@H](Cc1ccccc1)NC(=O)CNC(=O)CNC(=O)[C@@H](N)Cc1ccc(O)cc1)C(=O)N[C@@H](CCCNC(N)=N)C(=O)N1CCC[C@H]1C(=O)N[C@@H](CCCCN)C(=O)N[C@@H](CC(C)C)C(=O)N[C@@H](CCCCN)C(O)=O
: