Target
Aldo-keto reductase family 1 member C2
Ligand
BDBM50396691
Substrate
Meas. Tech.
Discontinuous Radiometric Assay
Ki
15000±n/a nM
Citation
 Penning, TMAdeniji, AOBurns, MCWinkler, JTwenter, B Bifunctional AKR1C3 inhibitors/androgen receptor modulators and methods of use thereof US Patent  US9271961 Publication Date 3/1/2016 
Target
Name:
Aldo-keto reductase family 1 member C2
Synonyms:
3-alpha-HSD3 AK1C2_HUMAN Aldo-keto reductase family 1 member C2 (AK1C2) Aldo-keto reductase family 1 member C2 (AKR1C2) DD-2 DDH2 Dihydrodiol dehydrogenase/bile acid-binding protein Type III 3-alpha-hydroxysteroid dehydrogenase
Type:
Enzyme
Mol. Mass.:
36739.89
Organism:
Homo sapiens (Human)
Description:
Residue:
323
  
Inhibitor
Name:
BDBM50396691
Synonyms:
CHEMBL449572 | US9271961, Jasmonic acid
Type:
Small organic molecule
Emp. Form.:
C12H18O3
Mol. Mass.:
210.2695
SMILES:
CC\C=C/C[C@@H]1[C@@H](CC(O)=O)CCC1=O
: