Target
Acetyl-CoA carboxylase 2 [27-2458]
Ligand
BDBM220130
Substrate
Meas. Tech.
Human ACC2 Enzyme Assay
pH
7.5±n/a
Temperature
295.15±n/a K
IC50
3130±n/a nM
Comments
extracted
Citation
 Liu, NThede, KMönning, UScholz, AHilger, CBömer, UFischer, R Substituted 3-(biphenyl-3-yl)-4-hydroxy-8-methoxy-1-azaspiro[4.5]dec-3-en-2-one US Patent  US9278925 Publication Date 3/8/2016 
Target
Name:
Acetyl-CoA carboxylase 2 [27-2458]
Synonyms:
ACACB ACC2 Acetyl-CoA carboxylase 2
Type:
Protein
Mol. Mass.:
273501.32
Organism:
Homo sapiens (Human)
Description:
amino acids 27-end
Residue:
2432
  
Inhibitor
Name:
BDBM220130
Synonyms:
US9278925, V.1-a | US9278925, V.3-a
Type:
Small organic molecule
Emp. Form.:
C24H26ClNO3
Mol. Mass.:
411.921
SMILES:
CO[C@@]1(C)CC[C@@]2(CC1)NC(=O)C(=C2O)c1cc(ccc1C)-c1ccc(Cl)cc1
: