Target
Amine oxidase [flavin-containing] A
Ligand
BDBM10989
Substrate
Meas. Tech.
MAO-A/MAO-B Inhibition Assay
pH
7.4±n/a
IC50
710±30 nM
Comments
extracted
Citation
 Yang, XQiang, XLi, YLuo, LXu, RZheng, YCao, ZTan, ZDeng, Y Pyridoxine-resveratrol hybrids Mannich base derivatives as novel dual inhibitors of AChE and MAO-B with antioxidant and metal-chelating properties for the treatment of Alzheimer's disease. Bioorg Chem 71:305-314 (2017)  
Target
Name:
Amine oxidase [flavin-containing] A
Synonyms:
AOFA_HUMAN MAO-A Monoamine oxidase Monoamine oxidase type A (MAO A) Monoamine oxidase type A (MAOA)
Type:
Protein
Mol. Mass.:
59689.53
Organism:
Homo sapiens (Human)
Description:
P21397
Residue:
527
  
Inhibitor
Name:
BDBM10989
Synonyms:
(1R)-N-(prop-2-yn-1-yl)-2,3-dihydro-1H-inden-1-amine Rasagiline | US9034303, Rasagiline
Type:
Small organic molecule
Emp. Form.:
C12H13N
Mol. Mass.:
171.2383
SMILES:
C#CCN[C@@H]1CCc2ccccc12
: