Target
Leukotriene C4 synthase
Ligand
BDBM223261
Substrate
LTC4
Meas. Tech.
In Vitro hLTC4 Synthase Enzyme Assay (Test A)
pH
7.8±n/a
IC50
9±n/a nM
Comments
extracted
Citation
 Ronn, RLindh, CJRingberg, EAndersson, HBNilsson, PSchaal, WRRosenschold, MMNikitidis, ANikitidis, GJohannesson, PTyrcha, C Compounds and uses  US Patent  US20160326143 Publication Date 11/10/2016 
Target
Name:
Leukotriene C4 synthase
Synonyms:
LTC4 synthase LTC4S_HUMAN | Leukotriene-C(4) synthase
Type:
PROTEIN
Mol. Mass.:
16575.59
Organism:
Homo sapiens (Human)
Description:
ChEMBL_961179
Residue:
150
  
Inhibitor
Name:
BDBM223261
Synonyms:
2-(5-((Cyclopropylmethyl)(1,2-dihydroacenaphthylen-5-yl)amino)-3-methoxypicolinoyl)cyclopropanecarboxylic acid US9657001, 36
Type:
Small Organic Molecule
Emp. Form.:
C27H26N2O4
Mol. Mass.:
442.5063
SMILES:
COc1cc(cnc1C(=O)C1CC1C(O)=O)N(CC1CC1)c1ccc2CCc3cccc1c23
:
Substrate
Name:
BDBM81801
Synonyms:
CAS_5283121 NSC_5283121
Type:
Small organic molecule
Emp. Form.:
C30H47N3O9S
Mol. Mass.:
625.774
SMILES:
CCCCCC=CCC=CC=CC=CC(SCC(NC(=O)CCC(N)C(O)=O)C(=O)NCC(O)=O)C(O)CCCC(O)=O
: