Target
Caspase-4
Ligand
BDBM50022271
Substrate
Meas. Tech.
Caspase Catalytic Activity Assay
pH
7.4±n/a
IC50
1.0e+4± 1e+3 nM
Comments
extracted
Citation
 Smith, CESoti, SJones, TANakagawa, AXue, DYin, H Non-steroidal Anti-inflammatory Drugs Are Caspase Inhibitors. Cell Chem Biol 24:281-292 (2017)  
Target
Name:
Caspase-4
Synonyms:
CASP-4 CASP4_HUMAN Caspase-4 subunit 1 ICE(rel)-II ICH2 | TX protease
Type:
Enzyme
Mol. Mass.:
43257.75
Organism:
Homo sapiens (Human)
Description:
P49662
Residue:
377
  
Inhibitor
Name:
BDBM50022271
Synonyms:
2-(3-Benzoylphenyl)propionic acid 3-Benzoyl-alpha-methylbenzeneacetic acid CHEMBL571 KETOPROFEN Orudis (TN) | m-Benzoylhydratropic acid
Type:
Small organic molecule
Emp. Form.:
C16H14O3
Mol. Mass.:
254.2806
SMILES:
CC(C(O)=O)c1cccc(c1)C(=O)c1ccccc1
: