Target
Caspase-3
Ligand
BDBM50339185
Substrate
Meas. Tech.
Caspase Catalytic Activity Assay
pH
7.4±n/a
IC50
5.5e+4± 7e+3 nM
Comments
extracted
Citation
 Smith, CESoti, SJones, TANakagawa, AXue, DYin, H Non-steroidal Anti-inflammatory Drugs Are Caspase Inhibitors. Cell Chem Biol 24:281-292 (2017)  
Target
Name:
Caspase-3
Synonyms:
Apopain CASP3 CPP-32 Caspase 3 Caspase-3 subunit p17 SCA-1 Yama protein | caspase-3 preproprotein
Type:
Hydrolase; heterotetramer of two heterodimers
Mol. Mass.:
31607.55
Organism:
Homo sapiens (Human)
Description:
Residue:
277
  
Inhibitor
Name:
BDBM50339185
Synonyms:
(2S)-2-(6-methoxynaphthalen-2-yl)propanoic acid (S)-2-(6-methoxynaphthalen-2-yl)propanoic acid 2-(6-Methoxy-naphthalen-2-yl)-propionic acid 2-(6-methoxy-2-naphthyl)propanoic acid Aleve CHEMBL154 Equiproxen Naprosyn Naproxen2-(6-Methoxy-naphthalen-2-yl)-propionic acid S-NAPROXEN naproxene
Type:
Small organic molecule
Emp. Form.:
C14H14O3
Mol. Mass.:
230.2592
SMILES:
COc1ccc2cc(ccc2c1)[C@H](C)C(O)=O
: