Target
Aldehyde dehydrogenase, dimeric NADP-preferring
Ligand
BDBM50447056
Substrate
Meas. Tech.
Inhibiton Assay
pH
7.5±n/a
IC50
200±50 nM
Comments
extracted
Citation
 Hurley, TD Regulators of aldehyde dehydrogenase ALDH3A1 and related therapeutic methods US Patent  US9320722 Publication Date 4/26/2016 
Target
Name:
Aldehyde dehydrogenase, dimeric NADP-preferring
Synonyms:
AL3A1_HUMAN ALDH3A1 Aldehyde dehydrogenase family 3 member A1 (ALDH3A1) | Aldehyde dehydrogenase family 3 member A1 (ALDH3A1) (Q122A)
Type:
Protein
Mol. Mass.:
50394.38
Organism:
Homo sapiens (Human)
Description:
Residue:
453
  
Inhibitor
Name:
BDBM50447056
Synonyms:
CHEMBL1378094 US9328112, CB7
Type:
Small organic molecule
Emp. Form.:
C14H11FN2O2S
Mol. Mass.:
290.313
SMILES:
Cc1nc2ccccc2n1S(=O)(=O)c1ccc(F)cc1
: