Target
Sialidase A
Ligand
BDBM4934
Substrate
Meas. Tech.
Sialidase Assay
pH
9±n/a
Ki
7.20e+5±n/a nM
Comments
extracted
Citation
 Hayre, JKXu, GBorgianni, LTaylor, GLAndrew, PWDocquier, JDOggioni, MR Optimization of a direct spectrophotometric method to investigate the kinetics and inhibition of sialidases. BMC Biochem 13:19 (2012)  
Target
Name:
Sialidase A
Synonyms:
NANA_STREE Sialidase A | nanA
Type:
Enzyme
Mol. Mass.:
114737.08
Organism:
Streptococcus pneumoniae
Description:
P62576; spr1536
Residue:
1035
  
Inhibitor
Name:
BDBM4934
Synonyms:
(2R,3R,4S)-4-carbamimidamido-3-acetamido-2-[(1R,2R)-1,2,3-trihydroxypropyl]-3,4-dihydro-2H-pyran-6-carboxylic acid Zanamivir
Type:
Small organic molecule
Emp. Form.:
C12H20N4O7
Mol. Mass.:
332.3098
SMILES:
[H][C@]1([#8]-[#6](=[#6]-[#6@H](\[#7]=[#6](/[#7])-[#7])-[#6@H]1-[#7]-[#6](-[#6])=O)-[#6](-[#8])=O)[#6@H](-[#8])-[#6@H](-[#8])-[#6]-[#8]
: