Target
Coagulation factor X
Ligand
BDBM50306150
Substrate
Meas. Tech.
D3R246
IC50
7.4±n/a nM
Citation
 D3R, DD GSK FactorXA-2 D3R 246:0 (2015) Target
Name:
Coagulation factor X
Synonyms:
Activated coagulation factor X (FXa) Coagulation factor X precursor F10 Factor X heavy chain Factor Xa Stuart-Prower factor
Type:
Enzyme
Mol. Mass.:
54726.60
Organism:
Homo sapiens (Human)
Description:
Residue:
488
  
Inhibitor
Name:
BDBM50306150
Synonyms:
(S)-4-(3-(2-(5-chlorothiophen-2-yl)vinylsulfonamido)-2-oxopyrrolidin-1-yl)-3-fluorobenzamide GTC000099A
Type:
Small organic molecule
Emp. Form.:
C17H15ClFN3O4S2
Mol. Mass.:
443.9
SMILES:
NC(=O)c1ccc(N2CC[C@H](NS(=O)(=O)\C=C\c3ccc(Cl)s3)C2=O)c(F)c1
: