Target
NAD-dependent protein deacylase sirtuin-6
Ligand
BDBM50216541
Substrate
Meas. Tech.
Fluorimetric Assay
IC50
9.268e+5± 2.495e+5 nM
Citation
 Bolívar, BEWelch, JT Studies of the Binding of Modest Modulators of the Human Enzyme, Sirtuin 6, by STD NMR. Chembiochem 18:931-940 (2017)  
Target
Name:
NAD-dependent protein deacylase sirtuin-6
Synonyms:
NAD-dependent protein deacetylase sirtuin-6 Regulatory protein SIR2 homolog 6 SIR2L6 SIRT6 | Sirtuin-6 (SIRT6)
Type:
Protein
Mol. Mass.:
39133.03
Organism:
Homo sapiens (Human)
Description:
Q8N6T7
Residue:
355
  
Inhibitor
Name:
BDBM50216541
Synonyms:
CHEMBL613 PYRAZINOIC ACID Rifater | pyrazinoicacid
Type:
Small organic molecule
Emp. Form.:
C5H4N2O2
Mol. Mass.:
124.0975
SMILES:
OC(=O)c1cnccn1
: