Target
Histone deacetylase 2
Ligand
BDBM34168
Substrate
Meas. Tech.
Fluorescent Activity Assay
Temperature
298.15±n/a K
IC50
25933±651 nM
Comments
extracted
Citation
 Lin, JFang, JChern, TChen, JChen, CWei, T 3,5,N-trihydroxy-alkanamide and derivatives: method for making same and use thereof US Patent  US9353061 Publication Date 5/31/2016 
Target
Name:
Histone deacetylase 2
Synonyms:
Cereblon/Histone deacetylase 2 HDAC2 Histone deacetylase 2 (HDAC2) | Human HDAC2
Type:
Chromatin regulator; hydrolase; repressor
Mol. Mass.:
55356.54
Organism:
Homo sapiens (Human)
Description:
Q92769
Residue:
488
  
Inhibitor
Name:
BDBM34168
Synonyms:
LOVASTATIN SMR000058779 US9353061, Lovastatina | cid_53232
Type:
Small organic molecule
Emp. Form.:
C24H36O5
Mol. Mass.:
404.5396
SMILES:
CC[C@H](C)C(=O)O[C@H]1C[C@@H](C)C=C2C=C[C@H](C)[C@H](CC[C@@H]3C[C@@H](O)CC(=O)O3)[C@@H]12
: