Target
Fatty acid-binding protein, adipocyte
Ligand
BDBM234701
Substrate
Meas. Tech.
Time Resolved-Fluorescence Energy Transfer (TR-FRET) Assay
pH
7.5±n/a
IC50
11±n/a nM
Comments
extracted
Citation
 Buettelmann, BCeccarelli, SMKuehne, HKuhn, BNeidhart, WObst Sander, URichter, H Non-annulated thiophenylamides US Patent  US9353102 Publication Date 5/31/2016 
Target
Name:
Fatty acid-binding protein, adipocyte
Synonyms:
A-FABP ALBP FABP4 Fatty acid binding protein adipocyte Fatty acid-binding protein 4 (FABP4)
Type:
Enzyme
Mol. Mass.:
14719.23
Organism:
Homo sapiens (Human)
Description:
P15090
Residue:
132
  
Inhibitor
Name:
BDBM234701
Synonyms:
US9353102, 4.7
Type:
Small organic molecule
Emp. Form.:
C18H19N3O3S2
Mol. Mass.:
389.492
SMILES:
Cc1sc(NC(=O)C2=C(CCC2)C(O)=O)c(c1C)-c1nc(ns1)C1CC1
: